Migrating WPS to gradle, this error pops up

classic Classic list List threaded Threaded
1 message Options
Reply | Threaded
Open this post in threaded view
|

Migrating WPS to gradle, this error pops up

radamar
$: gradle init

$: gradle build --stacktrace

:assemble UP-TO-DATE
:check UP-TO-DATE
:build UP-TO-DATE
:52n-wps-commons:compileJava UP-TO-DATE
:52n-wps-commons:processResources UP-TO-DATE
:52n-wps-commons:classes UP-TO-DATE
:52n-wps-commons:jar UP-TO-DATE
:52n-wps-io:compileJava UP-TO-DATE
:52n-wps-io:processResources UP-TO-DATE
:52n-wps-io:classes UP-TO-DATE
:52n-wps-io:jar UP-TO-DATE
:52n-wps-algorithm:compileJava UP-TO-DATE
:52n-wps-algorithm:processResources NO-SOURCE
:52n-wps-algorithm:classes UP-TO-DATE
:52n-wps-algorithm:jar UP-TO-DATE
:52n-wps-database:compileJava UP-TO-DATE
:52n-wps-database:processResources NO-SOURCE
:52n-wps-database:classes UP-TO-DATE
:52n-wps-database:jar UP-TO-DATE
:52n-wps-io-impl:compileJava UP-TO-DATE
:52n-wps-io-impl:processResources NO-SOURCE
:52n-wps-io-impl:classes UP-TO-DATE
:52n-wps-io-impl:jar UP-TO-DATE
:52n-wps-io-geotools:compileJava UP-TO-DATE
:52n-wps-io-geotools:processResources NO-SOURCE
:52n-wps-io-geotools:classes UP-TO-DATE
:52n-wps-io-geotools:jar UP-TO-DATE
:52n-wps-server:compileJava UP-TO-DATE
:52n-wps-server:processResources NO-SOURCE
:52n-wps-server:classes UP-TO-DATE
:52n-wps-server:jar UP-TO-DATE
:52n-wps-ags:compileJava UP-TO-DATE
:52n-wps-ags:processResources NO-SOURCE
:52n-wps-ags:classes UP-TO-DATE
:52n-wps-ags:jar UP-TO-DATE
:52n-wps-ags:assemble UP-TO-DATE
:52n-wps-ags:compileTestJava UP-TO-DATE
:52n-wps-ags:processTestResources NO-SOURCE
:52n-wps-ags:testClasses UP-TO-DATE
:52n-wps-ags:test UP-TO-DATE
:52n-wps-ags:check UP-TO-DATE
:52n-wps-ags:build UP-TO-DATE
:52n-wps-algorithm:compileTestJava UP-TO-DATE
:52n-wps-algorithm:processTestResources UP-TO-DATE
:52n-wps-algorithm:testClasses UP-TO-DATE
:52n-wps-algorithm:packageTests UP-TO-DATE
:52n-wps-algorithm:assemble UP-TO-DATE
:52n-wps-algorithm:test UP-TO-DATE
:52n-wps-algorithm:check UP-TO-DATE
:52n-wps-algorithm:build UP-TO-DATE
:52n-wps-algorithm-geotools:compileJava UP-TO-DATE
:52n-wps-algorithm-geotools:processResources NO-SOURCE
:52n-wps-algorithm-geotools:classes UP-TO-DATE
:52n-wps-algorithm-geotools:jar UP-TO-DATE
:52n-wps-algorithm-geotools:assemble UP-TO-DATE
:52n-wps-algorithm-geotools:compileTestJava UP-TO-DATE
:52n-wps-algorithm-geotools:processTestResources NO-SOURCE
:52n-wps-algorithm-geotools:testClasses UP-TO-DATE
:52n-wps-algorithm-geotools:test UP-TO-DATE
:52n-wps-algorithm-geotools:check UP-TO-DATE
:52n-wps-algorithm-geotools:build UP-TO-DATE
:52n-wps-algorithm-impl:compileJava UP-TO-DATE
:52n-wps-algorithm-impl:processResources NO-SOURCE
:52n-wps-algorithm-impl:classes UP-TO-DATE
:52n-wps-algorithm-impl:jar UP-TO-DATE
:52n-wps-algorithm-impl:assemble UP-TO-DATE
:52n-wps-algorithm-impl:compileTestJava NO-SOURCE
:52n-wps-algorithm-impl:processTestResources NO-SOURCE
:52n-wps-algorithm-impl:testClasses UP-TO-DATE
:52n-wps-algorithm-impl:test NO-SOURCE
:52n-wps-algorithm-impl:check UP-TO-DATE
:52n-wps-algorithm-impl:build UP-TO-DATE
:52n-wps-client-lib:compileJava UP-TO-DATE
:52n-wps-client-lib:processResources UP-TO-DATE
:52n-wps-client-lib:classes UP-TO-DATE
:52n-wps-client-lib:jar UP-TO-DATE
:52n-wps-client-lib:compileTestJava UP-TO-DATE
:52n-wps-client-lib:processTestResources NO-SOURCE
:52n-wps-client-lib:testClasses UP-TO-DATE
:52n-wps-client-lib:packageTests UP-TO-DATE
:52n-wps-client-lib:assemble UP-TO-DATE
:52n-wps-client-lib:test

org.n52.wps.client.test.ExecuteRequestBuilderTest >
addComplexDataInputByReference FAILED
    java.lang.RuntimeException at ExecuteRequestBuilderTest.java:45

org.n52.wps.client.test.ExecuteRequestBuilderTest >
setDefaultMimeTypeForOutput FAILED
    java.lang.RuntimeException at ExecuteRequestBuilderTest.java:45

org.n52.wps.client.test.ExecuteRequestBuilderTest >
addComplexDataInputString FAILED
    java.lang.RuntimeException at ExecuteRequestBuilderTest.java:45

org.n52.wps.client.test.ExecuteRequestBuilderTest >
setSupportedMimeTypeForOutput FAILED
    java.lang.RuntimeException at ExecuteRequestBuilderTest.java:45

4 tests completed, 4 failed
:52n-wps-client-lib:test FAILED

FAILURE: Build failed with an exception.

* What went wrong:
Execution failed for task ':52n-wps-client-lib:test'.
> There were failing tests. See the report at:
> file:///home/amar/git/WPS/52n-wps-client-lib/build/reports/tests/test/index.html

* Try:
Run with --info or --debug option to get more log output. Run with --scan to
get full insights.

* Exception is:
org.gradle.api.tasks.TaskExecutionException: Execution failed for task
':52n-wps-client-lib:test'.
        at
org.gradle.api.internal.tasks.execution.ExecuteActionsTaskExecuter.executeActions(ExecuteActionsTaskExecuter.java:103)
        at
org.gradle.api.internal.tasks.execution.ExecuteActionsTaskExecuter.execute(ExecuteActionsTaskExecuter.java:73)
        at
org.gradle.api.internal.tasks.execution.OutputDirectoryCreatingTaskExecuter.execute(OutputDirectoryCreatingTaskExecuter.java:51)
        at
org.gradle.api.internal.tasks.execution.SkipUpToDateTaskExecuter.execute(SkipUpToDateTaskExecuter.java:59)
        at
org.gradle.api.internal.tasks.execution.ResolveTaskOutputCachingStateExecuter.execute(ResolveTaskOutputCachingStateExecuter.java:54)
        at
org.gradle.api.internal.tasks.execution.ValidatingTaskExecuter.execute(ValidatingTaskExecuter.java:59)
        at
org.gradle.api.internal.tasks.execution.SkipEmptySourceFilesTaskExecuter.execute(SkipEmptySourceFilesTaskExecuter.java:101)
        at
org.gradle.api.internal.tasks.execution.FinalizeInputFilePropertiesTaskExecuter.execute(FinalizeInputFilePropertiesTaskExecuter.java:44)
        at
org.gradle.api.internal.tasks.execution.CleanupStaleOutputsExecuter.execute(CleanupStaleOutputsExecuter.java:91)
        at
org.gradle.api.internal.tasks.execution.ResolveTaskArtifactStateTaskExecuter.execute(ResolveTaskArtifactStateTaskExecuter.java:62)
        at
org.gradle.api.internal.tasks.execution.SkipTaskWithNoActionsExecuter.execute(SkipTaskWithNoActionsExecuter.java:59)
        at
org.gradle.api.internal.tasks.execution.SkipOnlyIfTaskExecuter.execute(SkipOnlyIfTaskExecuter.java:54)
        at
org.gradle.api.internal.tasks.execution.ExecuteAtMostOnceTaskExecuter.execute(ExecuteAtMostOnceTaskExecuter.java:43)
        at
org.gradle.api.internal.tasks.execution.CatchExceptionTaskExecuter.execute(CatchExceptionTaskExecuter.java:34)
        at
org.gradle.execution.taskgraph.DefaultTaskGraphExecuter$EventFiringTaskWorker$1.run(DefaultTaskGraphExecuter.java:256)
        at
org.gradle.internal.progress.DefaultBuildOperationExecutor$RunnableBuildOperationWorker.execute(DefaultBuildOperationExecutor.java:336)
        at
org.gradle.internal.progress.DefaultBuildOperationExecutor$RunnableBuildOperationWorker.execute(DefaultBuildOperationExecutor.java:328)
        at
org.gradle.internal.progress.DefaultBuildOperationExecutor.execute(DefaultBuildOperationExecutor.java:199)
        at
org.gradle.internal.progress.DefaultBuildOperationExecutor.run(DefaultBuildOperationExecutor.java:110)
        at
org.gradle.execution.taskgraph.DefaultTaskGraphExecuter$EventFiringTaskWorker.execute(DefaultTaskGraphExecuter.java:249)
        at
org.gradle.execution.taskgraph.DefaultTaskGraphExecuter$EventFiringTaskWorker.execute(DefaultTaskGraphExecuter.java:238)
        at
org.gradle.execution.taskgraph.DefaultTaskPlanExecutor$TaskExecutorWorker.processTask(DefaultTaskPlanExecutor.java:123)
        at
org.gradle.execution.taskgraph.DefaultTaskPlanExecutor$TaskExecutorWorker.access$200(DefaultTaskPlanExecutor.java:79)
        at
org.gradle.execution.taskgraph.DefaultTaskPlanExecutor$TaskExecutorWorker$1.execute(DefaultTaskPlanExecutor.java:104)
        at
org.gradle.execution.taskgraph.DefaultTaskPlanExecutor$TaskExecutorWorker$1.execute(DefaultTaskPlanExecutor.java:98)
        at
org.gradle.execution.taskgraph.DefaultTaskExecutionPlan.execute(DefaultTaskExecutionPlan.java:663)
        at
org.gradle.execution.taskgraph.DefaultTaskExecutionPlan.executeWithTask(DefaultTaskExecutionPlan.java:597)
        at
org.gradle.execution.taskgraph.DefaultTaskPlanExecutor$TaskExecutorWorker.run(DefaultTaskPlanExecutor.java:98)
        at
org.gradle.internal.concurrent.ExecutorPolicy$CatchAndRecordFailures.onExecute(ExecutorPolicy.java:63)
        at
org.gradle.internal.concurrent.ManagedExecutorImpl$1.run(ManagedExecutorImpl.java:46)
        at
org.gradle.internal.concurrent.ThreadFactoryImpl$ManagedThreadRunnable.run(ThreadFactoryImpl.java:55)
Caused by: org.gradle.api.GradleException: There were failing tests. See the
report at:
file:///home/amar/git/WPS/52n-wps-client-lib/build/reports/tests/test/index.html
        at
org.gradle.api.tasks.testing.AbstractTestTask.handleTestFailures(AbstractTestTask.java:611)
        at
org.gradle.api.tasks.testing.AbstractTestTask.executeTests(AbstractTestTask.java:483)
        at org.gradle.api.tasks.testing.Test.executeTests(Test.java:561)
        at org.gradle.internal.reflect.JavaMethod.invoke(JavaMethod.java:73)
        at
org.gradle.api.internal.project.taskfactory.StandardTaskAction.doExecute(StandardTaskAction.java:46)
        at
org.gradle.api.internal.project.taskfactory.StandardTaskAction.execute(StandardTaskAction.java:39)
        at
org.gradle.api.internal.project.taskfactory.StandardTaskAction.execute(StandardTaskAction.java:26)
        at
org.gradle.api.internal.AbstractTask$TaskActionWrapper.execute(AbstractTask.java:788)
        at
org.gradle.api.internal.AbstractTask$TaskActionWrapper.execute(AbstractTask.java:755)
        at
org.gradle.api.internal.tasks.execution.ExecuteActionsTaskExecuter$1.run(ExecuteActionsTaskExecuter.java:124)
        at
org.gradle.internal.progress.DefaultBuildOperationExecutor$RunnableBuildOperationWorker.execute(DefaultBuildOperationExecutor.java:336)
        at
org.gradle.internal.progress.DefaultBuildOperationExecutor$RunnableBuildOperationWorker.execute(DefaultBuildOperationExecutor.java:328)
        at
org.gradle.internal.progress.DefaultBuildOperationExecutor.execute(DefaultBuildOperationExecutor.java:199)
        at
org.gradle.internal.progress.DefaultBuildOperationExecutor.run(DefaultBuildOperationExecutor.java:110)
        at
org.gradle.api.internal.tasks.execution.ExecuteActionsTaskExecuter.executeAction(ExecuteActionsTaskExecuter.java:113)
        at
org.gradle.api.internal.tasks.execution.ExecuteActionsTaskExecuter.executeActions(ExecuteActionsTaskExecuter.java:95)
        ... 30 more


* Get more help at https://help.gradle.org

BUILD FAILED in 1s
36 actionable tasks: 1 executed, 35 up-to-date




--
Sent from: http://geoprocessing.forum.52north.org/
_______________________________________________
Geoprocessingservices mailing list
[hidden email]
https://list.52north.org/mailman/listinfo/geoprocessingservices
http://geoprocessing.forum.52north.org
Please respect our mailing list guidelines:
http://52north.org/resources/mailing-lists-and-forums/guidelines